#java #android #flutter #gradle
Вопрос:
несколько дней назад я попытался подключить свой проект flutter к firebase и использовать его sdk. Мне точно нравится документация, но с тех пор, как я получил эти ошибки:
Launching lib/main.dart on STK L21 in debug mode... FAILURE: Build failed with an exception. * What went wrong: A problem occurred configuring root project 'android'. gt; Could not resolve all artifacts for configuration ':classpath'. gt; Could not find com.android.tools.build:gradle:4.1.0. Searched in the following locations: - https://dl.google.com/dl/android/maven2/com/android/tools/build/gradle/4.1.0/gradle-4.1.0.pom - https://repo.maven.apache.org/maven2/com/android/tools/build/gradle/4.1.0/gradle-4.1.0.pom Required by: project : * Try: Run with --stacktrace option to get the stack trace. Run with --info or --debug option to get more log output. Run with --scan to get full insights. * Get more help at https://help.gradle.org BUILD FAILED in 19s Exception: Gradle task assembleDebug failed with exit code 1 Exited (sigterm)
даже когда я создаю новый проект flutter и запускаю его , я получаю эти ошибки. Я тоже не могу использовать ./gradlew
чистую сборку. Я перепробовал все возможные решения в Интернете, но не смог их исправить . Я схожу с ума , пожалуйста, помогите мне .