#quarkus
#quarkus
Вопрос:
Я пытаюсь использовать H2 в тесте с PanacheEntity, но у меня возникает ошибка при запуске данных в тесте.
[ERROR] Tests run: 1, Failures: 0, Errors: 1, Skipped: 0, Time elapsed: 0.013 s <<< FAILURE! - in org.acme.config.PersonResourceTest
[ERROR] org.acme.config.PersonResourceTest Time elapsed: 0.013 s <<< ERROR!
javax.enterprise.context.ContextNotActiveException:
at org.acme.config.PersonResourceTest.init(PersonResourceTest.java:34)
Исходный код:https://github.com/sbert/test-quarkus
Если я использую службу для инициализации данных и внедрения их в тест, все в порядке. Но это не может быть решением
Ответ №1:
Это было исправлено в предстоящем Quarkus 0.13.0, который должен быть выпущен сегодня, 4 апреля.
Смотрите эту проблему:https://github.com/quarkusio/quarkus/issues/1367 .